Makefile:930: warning: overriding commands for target `all-recursive
This presentation is the property of its rightful owner.
Sponsored Links
1 / 1

attachment PowerPoint PPT Presentation


  • 50 Views
  • Uploaded on
  • Presentation posted in: General

Download Presentation

attachment

An Image/Link below is provided (as is) to download presentation

Download Policy: Content on the Website is provided to you AS IS for your information and personal use and may not be sold / licensed / shared on other websites without getting consent from its author.While downloading, if for some reason you are not able to download a presentation, the publisher may have deleted the file from their server.


- - - - - - - - - - - - - - - - - - - - - - - - - - E N D - - - - - - - - - - - - - - - - - - - - - - - - - -

Presentation Transcript


Attachment

Makefile:930: warning: overriding commands for target `all-recursive'Makefile:424: warning: ignoring old commands for target `all-recursive'Makefile:933: warning: overriding commands for target `install-recursive'Makefile:424: warning: ignoring old commands for target `install-recursive'Makefile:930: warning: overriding commands for target `all-recursive'Makefile:424: warning: ignoring old commands for target `all-recursive'Makefile:933: warning: overriding commands for target `install-recursive'Makefile:424: warning: ignoring old commands for target `install-recursive'Makefile:930: warning: overriding commands for target `all-recursive'Makefile:424: warning: ignoring old commands for target `all-recursive'Makefile:933: warning: overriding commands for target `install-recursive'Makefile:424: warning: ignoring old commands for target `install-recursive'In file included from xcwrap.c:12:/local/sdm/sw/tk8.4/include/tk.h:70:20: tcl.h: No such file or directory/local/sdm/sw/tk8.4/include/tk.h:72:9: #error Tk 8.4 must be compiled with tcl.h from Tcl 8.4In file included from xcwrap.c:12:/local/sdm/sw/tk8.4/include/tk.h:140: syntax error before "char"/local/sdm/sw/tk8.4/include/tk.h:204: syntax error before "ClientData"/local/sdm/sw/tk8.4/include/tk.h:204: warning: no semicolon at end of struct or union/local/sdm/sw/tk8.4/include/tk.h:214: syntax error before '}' token/local/sdm/sw/tk8.4/include/tk.h:214: warning: data definition has no type or storage class/local/sdm/sw/tk8.4/include/tk.h:231: syntax error before "_ANSI_ARGS_"/local/sdm/sw/tk8.4/include/tk.h:234: syntax error before '*' token/local/sdm/sw/tk8.4/include/tk.h:234: syntax error before "_ANSI_ARGS_"/local/sdm/sw/tk8.4/include/tk.h:236: syntax error before "_ANSI_ARGS_"/local/sdm/sw/tk8.4/include/tk.h:238: syntax error before "_ANSI_ARGS_"/local/sdm/sw/tk8.4/include/tk.h:243: syntax error before "Tk_CustomOptionSetProc"/local/sdm/sw/tk8.4/include/tk.h:243: warning: no semicolon at end of struct or union/local/sdm/sw/tk8.4/include/tk.h:245: warning: data definition has no type or storage class/local/sdm/sw/tk8.4/include/tk.h:248: syntax error before '*' token/local/sdm/sw/tk8.4/include/tk.h:248: warning: data definition has no type or storage class/local/sdm/sw/tk8.4/include/tk.h:251: syntax error before '*' token/local/sdm/sw/tk8.4/include/tk.h:251: warning: data definition has no type or storage class/local/sdm/sw/tk8.4/include/tk.h:253: syntax error before "clientData"/local/sdm/sw/tk8.4/include/tk.h:253: warning: data definition has no type or storage class/local/sdm/sw/tk8.4/include/tk.h:255: warning: data definition has no type or storage class/local/sdm/sw/tk8.4/include/tk.h:283: syntax error before "Tcl_Obj"/local/sdm/sw/tk8.4/include/tk.h:283: warning: no semicolon at end of struct or union/local/sdm/sw/tk8.4/include/tk.h:299: syntax error before '}' token/local/sdm/sw/tk8.4/include/tk.h:299: warning: data definition has no type or storage class/local/sdm/sw/tk8.4/include/tk.h:314: syntax error before "Tk_SavedOption"/local/sdm/sw/tk8.4/include/tk.h:314: warning: no semicolon at end of struct or union/local/sdm/sw/tk8.4/include/tk.h:321: syntax error before '}' token/local/sdm/sw/tk8.4/include/tk.h:321: warning: data definition has no type or storage class/local/sdm/sw/tk8.4/include/tk.h:337: syntax error before "_ANSI_ARGS_"/local/sdm/sw/tk8.4/include/tk.h:340: syntax error before "_ANSI_ARGS_"/local/sdm/sw/tk8.4/include/tk.h:345: syntax error before "Tk_OptionParseProc"/local/sdm/sw/tk8.4/include/tk.h:345: warning: no semicolon at end of struct or union/local/sdm/sw/tk8.4/include/tk.h:348: warning: data definition has no type or storage class/local/sdm/sw/tk8.4/include/tk.h:351: syntax error before "clientData"/local/sdm/sw/tk8.4/include/tk.h:351: warning: data definition has no type or storage class/local/sdm/sw/tk8.4/include/tk.h:354: warning: data definition has no type or storage class/local/sdm/sw/tk8.4/include/tk.h:369: syntax error before "Tk_Uid"/local/sdm/sw/tk8.4/include/tk.h:369: warning: no semicolon at end of struct or union/local/sdm/sw/tk8.4/include/tk.h:370: warning: data definition has no type or storage class/local/sdm/sw/tk8.4/include/tk.h:371: syntax error before "defValue"/local/sdm/sw/tk8.4/include/tk.h:371: warning: data definition has no type or storage class/local/sdm/sw/tk8.4/include/tk.h:379: syntax error before '*' token/local/sdm/sw/tk8.4/include/tk.h:379: warning: data definition has no type or storage class/local/sdm/sw/tk8.4/include/tk.h:383: syntax error before '}' token/local/sdm/sw/tk8.4/include/tk.h:383: warning: data definition has no type or storage class/local/sdm/sw/tk8.4/include/tk.h:572: syntax error before "_ANSI_ARGS_"/local/sdm/sw/tk8.4/include/tk.h:574: syntax error before "_ANSI_ARGS_"/local/sdm/sw/tk8.4/include/tk.h:575: syntax error before "_ANSI_ARGS_"/local/sdm/sw/tk8.4/include/tk.h:580: syntax error before "Tk_ClassWorldChangedProc"/local/sdm/sw/tk8.4/include/tk.h:580: warning: no semicolon at end of struct or union/local/sdm/sw/tk8.4/include/tk.h:584: warning: data definition has no type or storage class/local/sdm/sw/tk8.4/include/tk.h:588: syntax error before '*' token/local/sdm/sw/tk8.4/include/tk.h:588: warning: data definition has no type or storage class/local/sdm/sw/tk8.4/include/tk.h:592: syntax error before '}' token/local/sdm/sw/tk8.4/include/tk.h:592: warning: data definition has no type or storage class/local/sdm/sw/tk8.4/include/tk.h:618: syntax error before "_ANSI_ARGS_"/local/sdm/sw/tk8.4/include/tk.h:620: syntax error before "_ANSI_ARGS_"/local/sdm/sw/tk8.4/include/tk.h:627: syntax error before "Tk_GeomRequestProc"/local/sdm/sw/tk8.4/include/tk.h:627: warning: no semicolon at end of struct or union/local/sdm/sw/tk8.4/include/tk.h:630: warning: data definition has no type or storage class/local/sdm/sw/tk8.4/include/tk.h:635: syntax error before '}' token/local/sdm/sw/tk8.4/include/tk.h:635: warning: data definition has no type or storage class/local/sdm/sw/tk8.4/include/tk.h:687: syntax error before "Tk_Uid"/local/sdm/sw/tk8.4/include/tk.h:687: warning: no semicolon at end of struct or union/local/sdm/sw/tk8.4/include/tk.h:689: syntax error before '}' token/local/sdm/sw/tk8.4/include/tk.h:689: warning: data definition has no type or storage class/local/sdm/sw/tk8.4/include/tk.h:783: syntax error before "Tk_Uid"/local/sdm/sw/tk8.4/include/tk.h:783: warning: no semicolon at end of struct or union/local/sdm/sw/tk8.4/include/tk.h:784: warning: data definition has no type or storage class/local/sdm/sw/tk8.4/include/tk.h:794: syntax error before '*' token/local/sdm/sw/tk8.4/include/tk.h:794: warning: data definition has no type or storage class/local/sdm/sw/tk8.4/include/tk.h:799: syntax error before "dummy15"/local/sdm/sw/tk8.4/include/tk.h:799: warning: data definition has no type or storage class/local/sdm/sw/tk8.4/include/tk.h:804: syntax error before "dummy18"/local/sdm/sw/tk8.4/include/tk.h:804: warning: data definition has no type or storage class/local/sdm/sw/tk8.4/include/tk.h:811: syntax error before '}' token/local/sdm/sw/tk8.4/include/tk.h:811: warning: data definition has no type or storage class/local/sdm/sw/tk8.4/include/tk.h:921: warning: no semicolon at end of struct or union/local/sdm/sw/tk8.4/include/tk.h:921: syntax error before "_ANSI_ARGS_"/local/sdm/sw/tk8.4/include/tk.h:924: syntax error before "_ANSI_ARGS_"/local/sdm/sw/tk8.4/include/tk.h:927: warning: data definition has no type or storage class/local/sdm/sw/tk8.4/include/tk.h:946: syntax error before "Tk_Uid"/local/sdm/sw/tk8.4/include/tk.h:946: warning: no semicolon at end of struct or union/local/sdm/sw/tk8.4/include/tk.h:948: warning: data definition has no type or storage class/local/sdm/sw/tk8.4/include/tk.h:980: syntax error before '}' token/local/sdm/sw/tk8.4/include/tk.h:980: warning: data definition has no type or storage class/local/sdm/sw/tk8.4/include/tk.h:1012: syntax error before "_ANSI_ARGS_"/local/sdm/sw/tk8.4/include/tk.h:1015: syntax error before "_ANSI_ARGS_"/local/sdm/sw/tk8.4/include/tk.h:1018: syntax error before "_ANSI_ARGS_"/local/sdm/sw/tk8.4/include/tk.h:1022: syntax error before "_ANSI_ARGS_"/local/sdm/sw/tk8.4/include/tk.h:1024: syntax error before "_ANSI_ARGS_"/local/sdm/sw/tk8.4/include/tk.h:1027: syntax error before "_ANSI_ARGS_"/local/sdm/sw/tk8.4/include/tk.h:1029: syntax error before "_ANSI_ARGS_"/local/sdm/sw/tk8.4/include/tk.h:1031: syntax error before "_ANSI_ARGS_"/local/sdm/sw/tk8.4/include/tk.h:1033: syntax error before "_ANSI_ARGS_"/local/sdm/sw/tk8.4/include/tk.h:1036: syntax error before "_ANSI_ARGS_"/local/sdm/sw/tk8.4/include/tk.h:1038: syntax error before "_ANSI_ARGS_"/local/sdm/sw/tk8.4/include/tk.h:1041: syntax error before "_ANSI_ARGS_"/local/sdm/sw/tk8.4/include/tk.h:1043: syntax error before "_ANSI_ARGS_"/local/sdm/sw/tk8.4/include/tk.h:1046: syntax error before "_ANSI_ARGS_"/local/sdm/sw/tk8.4/include/tk.h:1048: syntax error before "_ANSI_ARGS_"/local/sdm/sw/tk8.4/include/tk.h:1058: syntax error before "Tk_ItemCreateProc"/local/sdm/sw/tk8.4/include/tk.h:1058: warning: no semicolon at end of struct or union/local/sdm/sw/tk8.4/include/tk.h:1060: warning: data definition has no type or storage class/local/sdm/sw/tk8.4/include/tk.h:1063: syntax error before '*' token/local/sdm/sw/tk8.4/include/tk.h:1063: warning: data definition has no type or storage class/local/sdm/sw/tk8.4/include/tk.h:1065: syntax error before '*' token/local/sdm/sw/tk8.4/include/tk.h:1065: warning: data definition has no type or storage class/local/sdm/sw/tk8.4/include/tk.h:1067: syntax error before '*' token/local/sdm/sw/tk8.4/include/tk.h:1067: warning: data definition has no type or storage class/local/sdm/sw/tk8.4/include/tk.h:1069: syntax error before '*' token/local/sdm/sw/tk8.4/include/tk.h:1069: warning: data definition has no type or storage class/local/sdm/sw/tk8.4/include/tk.h:1074: syntax error before '*' token/local/sdm/sw/tk8.4/include/tk.h:1074: warning: data definition has no type or storage class/local/sdm/sw/tk8.4/include/tk.h:1076: syntax error before '*' token/local/sdm/sw/tk8.4/include/tk.h:1076: warning: data definition has no type or storage class/local/sdm/sw/tk8.4/include/tk.h:1078: syntax error before '*' token/local/sdm/sw/tk8.4/include/tk.h:1078: warning: data definition has no type or storage class/local/sdm/sw/tk8.4/include/tk.h:1082: syntax error before '*' token/local/sdm/sw/tk8.4/include/tk.h:1082: warning: data definition has no type or storage class/local/sdm/sw/tk8.4/include/tk.h:1084: syntax error before '*' token/local/sdm/sw/tk8.4/include/tk.h:1084: warning: data definition has no type or storage class/local/sdm/sw/tk8.4/include/tk.h:1086: syntax error before '*' token/local/sdm/sw/tk8.4/include/tk.h:1086: warning: data definition has no type or storage class/local/sdm/sw/tk8.4/include/tk.h:1089: syntax error before '*' token/local/sdm/sw/tk8.4/include/tk.h:1089: warning: data definition has no type or storage class/local/sdm/sw/tk8.4/include/tk.h:1091: syntax error before '*' token/local/sdm/sw/tk8.4/include/tk.h:1091: warning: data definition has no type or storage class/local/sdm/sw/tk8.4/include/tk.h:1094: syntax error before '*' token/local/sdm/sw/tk8.4/include/tk.h:1094: warning: data definition has no type or storage class/local/sdm/sw/tk8.4/include/tk.h:1096: syntax error before '*' token/local/sdm/sw/tk8.4/include/tk.h:1096: warning: data definition has no type or storage class/local/sdm/sw/tk8.4/include/tk.h:1098: conflicting types for `nextPtr'/local/sdm/sw/tk8.4/include/tk.h:316: previous declaration of `nextPtr'/local/sdm/sw/tk8.4/include/tk.h:1104: syntax error before '}' token/local/sdm/sw/tk8.4/include/tk.h:1104: warning: data definition has no type or storage class/local/sdm/sw/tk8.4/include/tk.h:1123: syntax error before "Tk_Item"/local/sdm/sw/tk8.4/include/tk.h:1123: warning: no semicolon at end of struct or union/local/sdm/sw/tk8.4/include/tk.h:1130: syntax error before '*' token/local/sdm/sw/tk8.4/include/tk.h:1130: warning: data definition has no type or storage class/local/sdm/sw/tk8.4/include/tk.h:1143: syntax error before '*' token/local/sdm/sw/tk8.4/include/tk.h:1143: warning: data definition has no type or storage class/local/sdm/sw/tk8.4/include/tk.h:1151: syntax error before '}' token/local/sdm/sw/tk8.4/include/tk.h:1151: warning: data definition has no type or storage class/local/sdm/sw/tk8.4/include/tk.h:1193: syntax error before "VOID"/local/sdm/sw/tk8.4/include/tk.h:1193: warning: no semicolon at end of struct or union/local/sdm/sw/tk8.4/include/tk.h:1194: conflicting types for `reserved2'/local/sdm/sw/tk8.4/include/tk.h:1101: previous declaration of `reserved2'/local/sdm/sw/tk8.4/include/tk.h:1194: warning: data definition has no type or storage class/local/sdm/sw/tk8.4/include/tk.h:1195: syntax error before '*' token/local/sdm/sw/tk8.4/include/tk.h:1195: conflicting types for `reserved3'/local/sdm/sw/tk8.4/include/tk.h:1102: previous declaration of `reserved3'/local/sdm/sw/tk8.4/include/tk.h:1195: warning: data definition has no type or storage class/local/sdm/sw/tk8.4/include/tk.h:1203: syntax error before '}' token/local/sdm/sw/tk8.4/include/tk.h:1203: warning: data definition has no type or storage class/local/sdm/sw/tk8.4/include/tk.h:1220: syntax error before "_ANSI_ARGS_"/local/sdm/sw/tk8.4/include/tk.h:1224: syntax error before "_ANSI_ARGS_"/local/sdm/sw/tk8.4/include/tk.h:1226: syntax error before "_ANSI_ARGS_"/local/sdm/sw/tk8.4/include/tk.h:1229: syntax error before "_ANSI_ARGS_"/local/sdm/sw/tk8.4/include/tk.h:1231: syntax error before "_ANSI_ARGS_"/local/sdm/sw/tk8.4/include/tk.h:1232: syntax error before "_ANSI_ARGS_"/local/sdm/sw/tk8.4/include/tk.h:1235: syntax error before "_ANSI_ARGS_"/local/sdm/sw/tk8.4/include/tk.h:1250: syntax error before "Tk_ImageCreateProc"/local/sdm/sw/tk8.4/include/tk.h:1250: warning: no semicolon at end of struct or union/local/sdm/sw/tk8.4/include/tk.h:1253: warning: data definition has no type or storage class/local/sdm/sw/tk8.4/include/tk.h:1256: syntax error before '*' token/local/sdm/sw/tk8.4/include/tk.h:1256: warning: data definition has no type or storage class/local/sdm/sw/tk8.4/include/tk.h:1259: syntax error before '*' token/local/sdm/sw/tk8.4/include/tk.h:1259: warning: data definition has no type or storage class/local/sdm/sw/tk8.4/include/tk.h:1262: syntax error before '*' token/local/sdm/sw/tk8.4/include/tk.h:1262: warning: data definition has no type or storage class/local/sdm/sw/tk8.4/include/tk.h:1267: syntax error before '*' token/local/sdm/sw/tk8.4/include/tk.h:1267: warning: data definition has no type or storage class/local/sdm/sw/tk8.4/include/tk.h:1270: conflicting types for `nextPtr'/local/sdm/sw/tk8.4/include/tk.h:1098: previous declaration of `nextPtr'/local/sdm/sw/tk8.4/include/tk.h:1275: syntax error before '}' token/local/sdm/sw/tk8.4/include/tk.h:1342: syntax error before "_ANSI_ARGS_"/local/sdm/sw/tk8.4/include/tk.h:1345: syntax error before "_ANSI_ARGS_"/local/sdm/sw/tk8.4/include/tk.h:1348: syntax error before "_ANSI_ARGS_"/local/sdm/sw/tk8.4/include/tk.h:1352: syntax error before "_ANSI_ARGS_"/local/sdm/sw/tk8.4/include/tk.h:1355: syntax error before "_ANSI_ARGS_"/local/sdm/sw/tk8.4/include/tk.h:1357: syntax error before "_ANSI_ARGS_"/local/sdm/sw/tk8.4/include/tk.h:1370: syntax error before "Tk_ImageFileMatchProc"/local/sdm/sw/tk8.4/include/tk.h:1370: warning: no semicolon at end of struct or union/local/sdm/sw/tk8.4/include/tk.h:1373: warning: data definition has no type or storage class/local/sdm/sw/tk8.4/include/tk.h:1376: syntax error before '*' token/local/sdm/sw/tk8.4/include/tk.h:1376: warning: data definition has no type or storage class/local/sdm/sw/tk8.4/include/tk.h:1379: syntax error before '*' token/local/sdm/sw/tk8.4/include/tk.h:1379: warning: data definition has no type or storage class/local/sdm/sw/tk8.4/include/tk.h:1382: syntax error before '*' token/local/sdm/sw/tk8.4/include/tk.h:1382: warning: data definition has no type or storage class/local/sdm/sw/tk8.4/include/tk.h:1385: syntax error before '*' token/local/sdm/sw/tk8.4/include/tk.h:1385: warning: data definition has no type or storage class/local/sdm/sw/tk8.4/include/tk.h:1389: conflicting types for `nextPtr'/local/sdm/sw/tk8.4/include/tk.h:1270: previous declaration of `nextPtr'/local/sdm/sw/tk8.4/include/tk.h:1393: syntax error before '}' token/local/sdm/sw/tk8.4/include/tk.h:1395: syntax error before "void"/local/sdm/sw/tk8.4/include/tk.h:1397: syntax error before "void"/local/sdm/sw/tk8.4/include/tk.h:1425: syntax error before "_ANSI_ARGS_"/local/sdm/sw/tk8.4/include/tk.h:1428: syntax error before "_ANSI_ARGS_"/local/sdm/sw/tk8.4/include/tk.h:1432: syntax error before "_ANSI_ARGS_"/local/sdm/sw/tk8.4/include/tk.h:1434: syntax error before "_ANSI_ARGS_"/local/sdm/sw/tk8.4/include/tk.h:1455: syntax error before "Tk_GetElementSizeProc"/local/sdm/sw/tk8.4/include/tk.h:1455: warning: no semicolon at end of struct or union/local/sdm/sw/tk8.4/include/tk.h:1459: warning: data definition has no type or storage class/local/sdm/sw/tk8.4/include/tk.h:1462: syntax error before '*' token/local/sdm/sw/tk8.4/include/tk.h:1462: warning: data definition has no type or storage class/local/sdm/sw/tk8.4/include/tk.h:1465: syntax error before '*' token/local/sdm/sw/tk8.4/include/tk.h:1465: warning: data definition has no type or storage class/local/sdm/sw/tk8.4/include/tk.h:1466: syntax error before '}' token/local/sdm/sw/tk8.4/include/tk.h:1466: warning: data definition has no type or storage class/local/sdm/sw/tk8.4/include/tk.h:1525: syntax error before "char"/local/sdm/sw/tk8.4/include/tk.h:1525: syntax error before "_ANSI_ARGS_"/local/sdm/sw/tk8.4/include/tk.h:1534: syntax error before "_ANSI_ARGS_"/local/sdm/sw/tk8.4/include/tk.h:1551: syntax error before "_ANSI_ARGS_"/local/sdm/sw/tk8.4/include/tk.h:1553: syntax error before "_ANSI_ARGS_"/local/sdm/sw/tk8.4/include/tk.h:1555: syntax error before "_ANSI_ARGS_"/local/sdm/sw/tk8.4/include/tk.h:1557: syntax error before "_ANSI_ARGS_"/local/sdm/sw/tk8.4/include/tk.h:1559: syntax error before "_ANSI_ARGS_"/local/sdm/sw/tk8.4/include/tk.h:1561: syntax error before "_ANSI_ARGS_"/local/sdm/sw/tk8.4/include/tk.h:1562: syntax error before "_ANSI_ARGS_"/local/sdm/sw/tk8.4/include/tk.h:1564: syntax error before "_ANSI_ARGS_"In file included from /local/sdm/sw/tk8.4/include/tk.h:1576, from xcwrap.c:12:/local/sdm/sw/tk8.4/include/tkDecls.h:35: syntax error before "void"/local/sdm/sw/tk8.4/include/tkDecls.h:37: syntax error before "XColor"/local/sdm/sw/tk8.4/include/tkDecls.h:37: syntax error before "_ANSI_ARGS_"/local/sdm/sw/tk8.4/include/tkDecls.h:39: syntax error before "GC"/local/sdm/sw/tk8.4/include/tkDecls.h:42: syntax error before "void"/local/sdm/sw/tk8.4/include/tkDecls.h:47: syntax error before "void"/local/sdm/sw/tk8.4/include/tkDecls.h:52: syntax error before "void"/local/sdm/sw/tk8.4/include/tkDecls.h:56: syntax error before "void"/local/sdm/sw/tk8.4/include/tkDecls.h:61: syntax error before "void"/local/sdm/sw/tk8.4/include/tkDecls.h:65: syntax error before "void"/local/sdm/sw/tk8.4/include/tkDecls.h:69: syntax error before "int"/local/sdm/sw/tk8.4/include/tkDecls.h:76: syntax error before "int"/local/sdm/sw/tk8.4/include/tkDecls.h:80: syntax error before "int"/local/sdm/sw/tk8.4/include/tkDecls.h:83: syntax error before "int"/local/sdm/sw/tk8.4/include/tkDecls.h:86: syntax error before "void"/local/sdm/sw/tk8.4/include/tkDecls.h:90: syntax error before "int"/local/sdm/sw/tk8.4/include/tkDecls.h:93: syntax error before "double"/local/sdm/sw/tk8.4/include/tkDecls.h:95: syntax error before "void"/local/sdm/sw/tk8.4/include/tkDecls.h:98: syntax error before "int"/local/sdm/sw/tk8.4/include/tkDecls.h:103: syntax error before "char"/local/sdm/sw/tk8.4/include/tkDecls.h:103: syntax error before "_ANSI_ARGS_"/local/sdm/sw/tk8.4/include/tkDecls.h:108: syntax error before "Tk_Window"/local/sdm/sw/tk8.4/include/tkDecls.h:110: syntax error before "void"/local/sdm/sw/tk8.4/include/tkDecls.h:114: syntax error before "void"/local/sdm/sw/tk8.4/include/tkDecls.h:118: syntax error before "int"/local/sdm/sw/tk8.4/include/tkDecls.h:122: syntax error before "void"/local/sdm/sw/tk8.4/include/tkDecls.h:125: syntax error before "int"/local/sdm/sw/tk8.4/include/tkDecls.h:129: syntax error before "int"/local/sdm/sw/tk8.4/include/tkDecls.h:132: syntax error before "int"/local/sdm/sw/tk8.4/include/tkDecls.h:137: syntax error before "int"/local/sdm/sw/tk8.4/include/tkDecls.h:142: syntax error before "int"/local/sdm/sw/tk8.4/include/tkDecls.h:147: syntax error before "void"/local/sdm/sw/tk8.4/include/tkDecls.h:151: syntax error before "Tk_TextLayout"/local/sdm/sw/tk8.4/include/tkDecls.h:156: syntax error before "Tk_Window"/local/sdm/sw/tk8.4/include/tkDecls.h:159: syntax error before "unsigned"/local/sdm/sw/tk8.4/include/tkDecls.h:159: syntax error before "_ANSI_ARGS_"/local/sdm/sw/tk8.4/include/tkDecls.h:164: syntax error before "Tk_BindingTable"/local/sdm/sw/tk8.4/include/tkDecls.h:167: syntax error before "Tk_ErrorHandler"/local/sdm/sw/tk8.4/include/tkDecls.h:172: syntax error before "void"/local/sdm/sw/tk8.4/include/tkDecls.h:176: syntax error before "void"/local/sdm/sw/tk8.4/include/tkDecls.h:179: syntax error before "void"/local/sdm/sw/tk8.4/include/tkDecls.h:182: syntax error before "void"/local/sdm/sw/tk8.4/include/tkDecls.h:184: syntax error before "void"/local/sdm/sw/tk8.4/include/tkDecls.h:187: syntax error before "void"/local/sdm/sw/tk8.4/include/tkDecls.h:192: syntax error before "Tk_Window"/local/sdm/sw/tk8.4/include/tkDecls.h:196: syntax error before "Tk_Window"/local/sdm/sw/tk8.4/include/tkDecls.h:201: syntax error before "int"/local/sdm/sw/tk8.4/include/tkDecls.h:205: syntax error before "void"/local/sdm/sw/tk8.4/include/tkDecls.h:208: syntax error before "void"/local/sdm/sw/tk8.4/include/tkDecls.h:212: syntax error before "int"/local/sdm/sw/tk8.4/include/tkDecls.h:216: syntax error before "void"/local/sdm/sw/tk8.4/include/tkDecls.h:219: syntax error before "void"/local/sdm/sw/tk8.4/include/tkDecls.h:222: syntax error before "void"/local/sdm/sw/tk8.4/include/tkDecls.h:226: syntax error before "void"/local/sdm/sw/tk8.4/include/tkDecls.h:229: syntax error before "void"/local/sdm/sw/tk8.4/include/tkDecls.h:232: syntax error before "void"/local/sdm/sw/tk8.4/include/tkDecls.h:235: syntax error before "void"/local/sdm/sw/tk8.4/include/tkDecls.h:237: syntax error before "char"/local/sdm/sw/tk8.4/include/tkDecls.h:237: syntax error before "_ANSI_ARGS_"/local/sdm/sw/tk8.4/include/tkDecls.h:239: syntax error before "int"/local/sdm/sw/tk8.4/include/tkDecls.h:242: syntax error before "void"/local/sdm/sw/tk8.4/include/tkDecls.h:247: syntax error before "void"/local/sdm/sw/tk8.4/include/tkDecls.h:252: syntax error before "void"/local/sdm/sw/tk8.4/include/tkDecls.h:257: syntax error before "void"/local/sdm/sw/tk8.4/include/tkDecls.h:260: syntax error before "void"/local/sdm/sw/tk8.4/include/tkDecls.h:265: syntax error before "void"/local/sdm/sw/tk8.4/include/tkDecls.h:270: syntax error before "void"/local/sdm/sw/tk8.4/include/tkDecls.h:275: syntax error before "Tk_PhotoHandle"/local/sdm/sw/tk8.4/include/tkDecls.h:278: syntax error before "Font"/local/sdm/sw/tk8.4/include/tkDecls.h:280: syntax error before "void"/local/sdm/sw/tk8.4/include/tkDecls.h:282: syntax error before "void"/local/sdm/sw/tk8.4/include/tkDecls.h:285: syntax error before "void"/local/sdm/sw/tk8.4/include/tkDecls.h:287: syntax error before "void"/local/sdm/sw/tk8.4/include/tkDecls.h:290: syntax error before "void"/local/sdm/sw/tk8.4/include/tkDecls.h:293: syntax error before "void"/local/sdm/sw/tk8.4/include/tkDecls.h:295: syntax error before "void"/local/sdm/sw/tk8.4/include/tkDecls.h:297: syntax error before "void"/local/sdm/sw/tk8.4/include/tkDecls.h:299: syntax error before "void"/local/sdm/sw/tk8.4/include/tkDecls.h:303: syntax error before "void"/local/sdm/sw/tk8.4/include/tkDecls.h:306: syntax error before "void"/local/sdm/sw/tk8.4/include/tkDecls.h:309: syntax error before "void"/local/sdm/sw/tk8.4/include/tkDecls.h:311: syntax error before "GC"/local/sdm/sw/tk8.4/include/tkDecls.h:314: syntax error before "void"/local/sdm/sw/tk8.4/include/tkDecls.h:317: syntax error before "Tk_3DBorder"/local/sdm/sw/tk8.4/include/tkDecls.h:320: syntax error before "void"/local/sdm/sw/tk8.4/include/tkDecls.h:324: syntax error before "int"/local/sdm/sw/tk8.4/include/tkDecls.h:327: syntax error before "char"/local/sdm/sw/tk8.4/include/tkDecls.h:327: syntax error before "_ANSI_ARGS_"/local/sdm/sw/tk8.4/include/tkDecls.h:330: syntax error before "char"/local/sdm/sw/tk8.4/include/tkDecls.h:330: syntax error before "_ANSI_ARGS_"/local/sdm/sw/tk8.4/include/tkDecls.h:334: syntax error before "Pixmap"/local/sdm/sw/tk8.4/include/tkDecls.h:337: syntax error before "Pixmap"/local/sdm/sw/tk8.4/include/tkDecls.h:341: syntax error before "int"/local/sdm/sw/tk8.4/include/tkDecls.h:344: syntax error before "XColor"/local/sdm/sw/tk8.4/include/tkDecls.h:344: syntax error before "_ANSI_ARGS_"/local/sdm/sw/tk8.4/include/tkDecls.h:347: syntax error before "XColor"/local/sdm/sw/tk8.4/include/tkDecls.h:347: syntax error before "_ANSI_ARGS_"/local/sdm/sw/tk8.4/include/tkDecls.h:350: syntax error before "Colormap"/local/sdm/sw/tk8.4/include/tkDecls.h:353: syntax error before "Tk_Cursor"/local/sdm/sw/tk8.4/include/tkDecls.h:356: syntax error before "Tk_Cursor"/local/sdm/sw/tk8.4/include/tkDecls.h:362: syntax error before "Tk_Font"/local/sdm/sw/tk8.4/include/tkDecls.h:365: syntax error before "Tk_Font"/local/sdm/sw/tk8.4/include/tkDecls.h:368: syntax error before "void"/local/sdm/sw/tk8.4/include/tkDecls.h:371: syntax error before "GC"/local/sdm/sw/tk8.4/include/tkDecls.h:375: syntax error before "Tk_Image"/local/sdm/sw/tk8.4/include/tkDecls.h:386: syntax error before "int"/local/sdm/sw/tk8.4/include/tkDecls.h:389: syntax error before "int"/local/sdm/sw/tk8.4/include/tkDecls.h:392: syntax error before "int"/local/sdm/sw/tk8.4/include/tkDecls.h:397: syntax error before "int"/local/sdm/sw/tk8.4/include/tkDecls.h:401: syntax error before "Pixmap"/local/sdm/sw/tk8.4/include/tkDecls.h:404: syntax error before "int"/local/sdm/sw/tk8.4/include/tkDecls.h:407: syntax error before "void"/local/sdm/sw/tk8.4/include/tkDecls.h:410: syntax error before "int"/local/sdm/sw/tk8.4/include/tkDecls.h:414: syntax error before "int"/local/sdm/sw/tk8.4/include/tkDecls.h:418: syntax error before "int"/local/sdm/sw/tk8.4/include/tkDecls.h:424: syntax error before "Visual"/local/sdm/sw/tk8.4/include/tkDecls.h:424: syntax error before "_ANSI_ARGS_"/local/sdm/sw/tk8.4/include/tkDecls.h:428: syntax error before "void"/local/sdm/sw/tk8.4/include/tkDecls.h:432: syntax error before "int"/local/sdm/sw/tk8.4/include/tkDecls.h:435: syntax error before "void"/local/sdm/sw/tk8.4/include/tkDecls.h:437: syntax error before "Tk_Window"/local/sdm/sw/tk8.4/include/tkDecls.h:440: syntax error before "void"/local/sdm/sw/tk8.4/include/tkDecls.h:444: syntax error before "int"/local/sdm/sw/tk8.4/include/tkDecls.h:446: syntax error before "Atom"/local/sdm/sw/tk8.4/include/tkDecls.h:449: syntax error before "int"/local/sdm/sw/tk8.4/include/tkDecls.h:453: syntax error before "void"/local/sdm/sw/tk8.4/include/tkDecls.h:457: syntax error before "Tk_Window"/local/sdm/sw/tk8.4/include/tkDecls.h:459: syntax error before "void"/local/sdm/sw/tk8.4/include/tkDecls.h:461: syntax error before "void"/local/sdm/sw/tk8.4/include/tkDecls.h:464: syntax error before "void"/local/sdm/sw/tk8.4/include/tkDecls.h:466: syntax error before "int"/local/sdm/sw/tk8.4/include/tkDecls.h:470: syntax error before "void"/local/sdm/sw/tk8.4/include/tkDecls.h:473: syntax error before "void"/local/sdm/sw/tk8.4/include/tkDecls.h:476: syntax error before "void"/local/sdm/sw/tk8.4/include/tkDecls.h:479: syntax error before "char"/local/sdm/sw/tk8.4/include/tkDecls.h:479: syntax error before "_ANSI_ARGS_"/local/sdm/sw/tk8.4/include/tkDecls.h:482: syntax error before "char"/local/sdm/sw/tk8.4/include/tkDecls.h:482: syntax error before "_ANSI_ARGS_"/local/sdm/sw/tk8.4/include/tkDecls.h:484: syntax error before "char"/local/sdm/sw/tk8.4/include/tkDecls.h:484: syntax error before "_ANSI_ARGS_"/local/sdm/sw/tk8.4/include/tkDecls.h:487: syntax error before "char"/local/sdm/sw/tk8.4/include/tkDecls.h:487: syntax error before "_ANSI_ARGS_"/local/sdm/sw/tk8.4/include/tkDecls.h:489: syntax error before "char"/local/sdm/sw/tk8.4/include/tkDecls.h:489: syntax error before "_ANSI_ARGS_"/local/sdm/sw/tk8.4/include/tkDecls.h:491: syntax error before "char"/local/sdm/sw/tk8.4/include/tkDecls.h:491: syntax error before "_ANSI_ARGS_"/local/sdm/sw/tk8.4/include/tkDecls.h:494: syntax error before "char"/local/sdm/sw/tk8.4/include/tkDecls.h:494: syntax error before "_ANSI_ARGS_"/local/sdm/sw/tk8.4/include/tkDecls.h:496: syntax error before "char"/local/sdm/sw/tk8.4/include/tkDecls.h:496: syntax error before "_ANSI_ARGS_"/local/sdm/sw/tk8.4/include/tkDecls.h:499: syntax error before "char"/local/sdm/sw/tk8.4/include/tkDecls.h:499: syntax error before "_ANSI_ARGS_"/local/sdm/sw/tk8.4/include/tkDecls.h:501: syntax error before "char"/local/sdm/sw/tk8.4/include/tkDecls.h:501: syntax error before "_ANSI_ARGS_"/local/sdm/sw/tk8.4/include/tkDecls.h:504: syntax error before "char"/local/sdm/sw/tk8.4/include/tkDecls.h:504: syntax error before "_ANSI_ARGS_"/local/sdm/sw/tk8.4/include/tkDecls.h:506: syntax error before "Tk_Window"/local/sdm/sw/tk8.4/include/tkDecls.h:509: syntax error before "void"/local/sdm/sw/tk8.4/include/tkDecls.h:513: syntax error before "int"/local/sdm/sw/tk8.4/include/tkDecls.h:518: syntax error before "void"/local/sdm/sw/tk8.4/include/tkDecls.h:523: syntax error before "void"/local/sdm/sw/tk8.4/include/tkDecls.h:529: syntax error before "int"/local/sdm/sw/tk8.4/include/tkDecls.h:532: syntax error before "void"/local/sdm/sw/tk8.4/include/tkDecls.h:534: syntax error before "void"/local/sdm/sw/tk8.4/include/tkDecls.h:537: syntax error before "void"/local/sdm/sw/tk8.4/include/tkDecls.h:540: syntax error before "void"/local/sdm/sw/tk8.4/include/tkDecls.h:543: syntax error before "int"/local/sdm/sw/tk8.4/include/tkDecls.h:546: syntax error before "int"/local/sdm/sw/tk8.4/include/tkDecls.h:549: syntax error before "void"/local/sdm/sw/tk8.4/include/tkDecls.h:552: syntax error before "void"/local/sdm/sw/tk8.4/include/tkDecls.h:555: syntax error before "void"/local/sdm/sw/tk8.4/include/tkDecls.h:560: syntax error before "void"/local/sdm/sw/tk8.4/include/tkDecls.h:563: syntax error before "int"/local/sdm/sw/tk8.4/include/tkDecls.h:570: syntax error before "int"/local/sdm/sw/tk8.4/include/tkDecls.h:572: syntax error before "char"/local/sdm/sw/tk8.4/include/tkDecls.h:572: syntax error before "_ANSI_ARGS_"/local/sdm/sw/tk8.4/include/tkDecls.h:575: syntax error before "void"/local/sdm/sw/tk8.4/include/tkDecls.h:578: syntax error before "void"/local/sdm/sw/tk8.4/include/tkDecls.h:581: syntax error before "void"/local/sdm/sw/tk8.4/include/tkDecls.h:585: syntax error before "void"/local/sdm/sw/tk8.4/include/tkDecls.h:588: syntax error before "void"/local/sdm/sw/tk8.4/include/tkDecls.h:591: syntax error before "void"/local/sdm/sw/tk8.4/include/tkDecls.h:594: syntax error before "void"/local/sdm/sw/tk8.4/include/tkDecls.h:597: syntax error before "void"/local/sdm/sw/tk8.4/include/tkDecls.h:600: syntax error before "void"/local/sdm/sw/tk8.4/include/tkDecls.h:603: syntax error before "void"/local/sdm/sw/tk8.4/include/tkDecls.h:606: syntax error before "int"/local/sdm/sw/tk8.4/include/tkDecls.h:610: syntax error before "void"/local/sdm/sw/tk8.4/include/tkDecls.h:614: syntax error before "void"/local/sdm/sw/tk8.4/include/tkDecls.h:617: syntax error before "int"/local/sdm/sw/tk8.4/include/tkDecls.h:619: syntax error before "void"/local/sdm/sw/tk8.4/include/tkDecls.h:622: syntax error before "int"/local/sdm/sw/tk8.4/include/tkDecls.h:625: syntax error before "void"/local/sdm/sw/tk8.4/include/tkDecls.h:627: syntax error before "void"/local/sdm/sw/tk8.4/include/tkDecls.h:632: syntax error before "void"/local/sdm/sw/tk8.4/include/tkDecls.h:637: syntax error before "void"/local/sdm/sw/tk8.4/include/tkDecls.h:639: syntax error before "void"/local/sdm/sw/tk8.4/include/tkDecls.h:642: syntax error before "void"/local/sdm/sw/tk8.4/include/tkDecls.h:644: syntax error before "void"/local/sdm/sw/tk8.4/include/tkDecls.h:646: syntax error before "void"/local/sdm/sw/tk8.4/include/tkDecls.h:649: syntax error before "Pixmap"/local/sdm/sw/tk8.4/include/tkDecls.h:653: syntax error before "Tk_3DBorder"/local/sdm/sw/tk8.4/include/tkDecls.h:657: syntax error before "XColor"/local/sdm/sw/tk8.4/include/tkDecls.h:657: syntax error before "_ANSI_ARGS_"/local/sdm/sw/tk8.4/include/tkDecls.h:661: syntax error before "Tk_Cursor"/local/sdm/sw/tk8.4/include/tkDecls.h:665: syntax error before "Tk_Font"/local/sdm/sw/tk8.4/include/tkDecls.h:668: syntax error before "Tk_OptionTable"/local/sdm/sw/tk8.4/include/tkDecls.h:672: syntax error before "void"/local/sdm/sw/tk8.4/include/tkDecls.h:675: syntax error before "void"/local/sdm/sw/tk8.4/include/tkDecls.h:678: syntax error before "void"/local/sdm/sw/tk8.4/include/tkDecls.h:681: syntax error before "void"/local/sdm/sw/tk8.4/include/tkDecls.h:684: syntax error before "void"/local/sdm/sw/tk8.4/include/tkDecls.h:687: syntax error before "void"/local/sdm/sw/tk8.4/include/tkDecls.h:690: syntax error before "void"/local/sdm/sw/tk8.4/include/tkDecls.h:693: syntax error before "void"/local/sdm/sw/tk8.4/include/tkDecls.h:696: syntax error before "Tk_3DBorder"/local/sdm/sw/tk8.4/include/tkDecls.h:699: syntax error before "int"/local/sdm/sw/tk8.4/include/tkDecls.h:702: syntax error before "Pixmap"/local/sdm/sw/tk8.4/include/tkDecls.h:705: syntax error before "XColor"/local/sdm/sw/tk8.4/include/tkDecls.h:705: syntax error before "_ANSI_ARGS_"/local/sdm/sw/tk8.4/include/tkDecls.h:708: syntax error before "Tk_Cursor"/local/sdm/sw/tk8.4/include/tkDecls.h:719: syntax error before "int"/local/sdm/sw/tk8.4/include/tkDecls.h:723: syntax error before "int"/local/sdm/sw/tk8.4/include/tkDecls.h:727: syntax error before "int"/local/sdm/sw/tk8.4/include/tkDecls.h:731: syntax error before "int"/local/sdm/sw/tk8.4/include/tkDecls.h:734: syntax error before "int"/local/sdm/sw/tk8.4/include/tkDecls.h:738: syntax error before "int"/local/sdm/sw/tk8.4/include/tkDecls.h:742: syntax error before "void"/local/sdm/sw/tk8.4/include/tkDecls.h:746: syntax error before "void"/local/sdm/sw/tk8.4/include/tkDecls.h:749: syntax error before "int"/local/sdm/sw/tk8.4/include/tkDecls.h:755: syntax error before "void"/local/sdm/sw/tk8.4/include/tkDecls.h:758: syntax error before "int"/local/sdm/sw/tk8.4/include/tkDecls.h:761: syntax error before "void"/local/sdm/sw/tk8.4/include/tkDecls.h:767: syntax error before "int"/local/sdm/sw/tk8.4/include/tkDecls.h:770: syntax error before "void"/local/sdm/sw/tk8.4/include/tkDecls.h:772: syntax error before "void"/local/sdm/sw/tk8.4/include/tkDecls.h:775: syntax error before "int"/local/sdm/sw/tk8.4/include/tkDecls.h:779: syntax error before "int"/local/sdm/sw/tk8.4/include/tkDecls.h:782: syntax error before "int"/local/sdm/sw/tk8.4/include/tkDecls.h:785: syntax error before "int"/local/sdm/sw/tk8.4/include/tkDecls.h:788: syntax error before "void"/local/sdm/sw/tk8.4/include/tkDecls.h:791: syntax error before "int"/local/sdm/sw/tk8.4/include/tkDecls.h:795: syntax error before "void"/local/sdm/sw/tk8.4/include/tkDecls.h:798: syntax error before "void"/local/sdm/sw/tk8.4/include/tkDecls.h:801: syntax error before "int"/local/sdm/sw/tk8.4/include/tkDecls.h:806: syntax error before "int"/local/sdm/sw/tk8.4/include/tkDecls.h:809: syntax error before "int"/local/sdm/sw/tk8.4/include/tkDecls.h:812: syntax error before "int"/local/sdm/sw/tk8.4/include/tkDecls.h:817: syntax error before "void"/local/sdm/sw/tk8.4/include/tkDecls.h:821: syntax error before "int"/local/sdm/sw/tk8.4/include/tkDecls.h:825: syntax error before "double"/local/sdm/sw/tk8.4/include/tkDecls.h:828: syntax error before "int"/local/sdm/sw/tk8.4/include/tkDecls.h:833: syntax error before "void"/local/sdm/sw/tk8.4/include/tkDecls.h:836: syntax error before "void"/local/sdm/sw/tk8.4/include/tkDecls.h:839: syntax error before "Tk_Window"/local/sdm/sw/tk8.4/include/tkDecls.h:843: syntax error before "void"/local/sdm/sw/tk8.4/include/tkDecls.h:847: syntax error before "void"/local/sdm/sw/tk8.4/include/tkDecls.h:850: syntax error before "void"/local/sdm/sw/tk8.4/include/tkDecls.h:853: syntax error before "void"/local/sdm/sw/tk8.4/include/tkDecls.h:856: syntax error before "void"/local/sdm/sw/tk8.4/include/tkDecls.h:860: syntax error before "void"/local/sdm/sw/tk8.4/include/tkDecls.h:866: syntax error before "int"/local/sdm/sw/tk8.4/include/tkDecls.h:869: syntax error before "Tk_StyleEngine"/local/sdm/sw/tk8.4/include/tkDecls.h:872: syntax error before "Tk_StyleEngine"/local/sdm/sw/tk8.4/include/tkDecls.h:874: syntax error before "int"/local/sdm/sw/tk8.4/include/tkDecls.h:878: syntax error before "int"/local/sdm/sw/tk8.4/include/tkDecls.h:880: syntax error before "Tk_Style"/local/sdm/sw/tk8.4/include/tkDecls.h:883: syntax error before "Tk_Style"/local/sdm/sw/tk8.4/include/tkDecls.h:886: syntax error before "void"/local/sdm/sw/tk8.4/include/tkDecls.h:888: syntax error before "char"/local/sdm/sw/tk8.4/include/tkDecls.h:888: syntax error before "_ANSI_ARGS_"/local/sdm/sw/tk8.4/include/tkDecls.h:890: syntax error before "Tk_Style"/local/sdm/sw/tk8.4/include/tkDecls.h:893: syntax error before "Tk_Style"/local/sdm/sw/tk8.4/include/tkDecls.h:895: syntax error before "void"/local/sdm/sw/tk8.4/include/tkDecls.h:897: syntax error before "Tk_StyledElement"/local/sdm/sw/tk8.4/include/tkDecls.h:900: syntax error before "void"/local/sdm/sw/tk8.4/include/tkDecls.h:905: syntax error before "void"/local/sdm/sw/tk8.4/include/tkDecls.h:911: syntax error before "int"/local/sdm/sw/tk8.4/include/tkDecls.h:915: syntax error before "void"/local/sdm/sw/tk8.4/include/tkDecls.h:931: warning: no semicolon at end of struct or union/local/sdm/sw/tk8.4/include/tkDecls.h:931: syntax error before "_ANSI_ARGS_"/local/sdm/sw/tk8.4/include/tkDecls.h:932: syntax error before "_ANSI_ARGS_"/local/sdm/sw/tk8.4/include/tkDecls.h:933: syntax error before "_ANSI_ARGS_"/local/sdm/sw/tk8.4/include/tkDecls.h:934: syntax error before "_ANSI_ARGS_"/local/sdm/sw/tk8.4/include/tkDecls.h:935: syntax error before "_ANSI_ARGS_"/local/sdm/sw/tk8.4/include/tkDecls.h:936: syntax error before "_ANSI_ARGS_"/local/sdm/sw/tk8.4/include/tkDecls.h:937: syntax error before "_ANSI_ARGS_"/local/sdm/sw/tk8.4/include/tkDecls.h:938: syntax error before "_ANSI_ARGS_"/local/sdm/sw/tk8.4/include/tkDecls.h:939: syntax error before "_ANSI_ARGS_"/local/sdm/sw/tk8.4/include/tkDecls.h:940: syntax error before "_ANSI_ARGS_"/local/sdm/sw/tk8.4/include/tkDecls.h:941: syntax error before "_ANSI_ARGS_"/local/sdm/sw/tk8.4/include/tkDecls.h:942: syntax error before "_ANSI_ARGS_"/local/sdm/sw/tk8.4/include/tkDecls.h:943: syntax error before "_ANSI_ARGS_"/local/sdm/sw/tk8.4/include/tkDecls.h:944: syntax error before "_ANSI_ARGS_"/local/sdm/sw/tk8.4/include/tkDecls.h:945: syntax error before "_ANSI_ARGS_"/local/sdm/sw/tk8.4/include/tkDecls.h:946: syntax error before "_ANSI_ARGS_"/local/sdm/sw/tk8.4/include/tkDecls.h:947: syntax error before "_ANSI_ARGS_"/local/sdm/sw/tk8.4/include/tkDecls.h:948: syntax error before "_ANSI_ARGS_"/local/sdm/sw/tk8.4/include/tkDecls.h:949: syntax error before "_ANSI_ARGS_"/local/sdm/sw/tk8.4/include/tkDecls.h:950: syntax error before "_ANSI_ARGS_"/local/sdm/sw/tk8.4/include/tkDecls.h:951: syntax error before "_ANSI_ARGS_"/local/sdm/sw/tk8.4/include/tkDecls.h:952: syntax error before "_ANSI_ARGS_"/local/sdm/sw/tk8.4/include/tkDecls.h:953: syntax error before "_ANSI_ARGS_"/local/sdm/sw/tk8.4/include/tkDecls.h:954: syntax error before "_ANSI_ARGS_"/local/sdm/sw/tk8.4/include/tkDecls.h:955: syntax error before "_ANSI_ARGS_"/local/sdm/sw/tk8.4/include/tkDecls.h:956: syntax error before "_ANSI_ARGS_"/local/sdm/sw/tk8.4/include/tkDecls.h:957: syntax error before "_ANSI_ARGS_"/local/sdm/sw/tk8.4/include/tkDecls.h:958: syntax error before "_ANSI_ARGS_"/local/sdm/sw/tk8.4/include/tkDecls.h:959: syntax error before "_ANSI_ARGS_"/local/sdm/sw/tk8.4/include/tkDecls.h:960: syntax error before "_ANSI_ARGS_"/local/sdm/sw/tk8.4/include/tkDecls.h:961: syntax error before "_ANSI_ARGS_"/local/sdm/sw/tk8.4/include/tkDecls.h:962: syntax error before "_ANSI_ARGS_"/local/sdm/sw/tk8.4/include/tkDecls.h:963: syntax error before "_ANSI_ARGS_"/local/sdm/sw/tk8.4/include/tkDecls.h:964: syntax error before "_ANSI_ARGS_"/local/sdm/sw/tk8.4/include/tkDecls.h:965: syntax error before "_ANSI_ARGS_"/local/sdm/sw/tk8.4/include/tkDecls.h:966: syntax error before "_ANSI_ARGS_"/local/sdm/sw/tk8.4/include/tkDecls.h:967: syntax error before "_ANSI_ARGS_"/local/sdm/sw/tk8.4/include/tkDecls.h:968: syntax error before "_ANSI_ARGS_"/local/sdm/sw/tk8.4/include/tkDecls.h:969: syntax error before "_ANSI_ARGS_"/local/sdm/sw/tk8.4/include/tkDecls.h:970: syntax error before "_ANSI_ARGS_"/local/sdm/sw/tk8.4/include/tkDecls.h:971: syntax error before "_ANSI_ARGS_"/local/sdm/sw/tk8.4/include/tkDecls.h:972: syntax error before "_ANSI_ARGS_"/local/sdm/sw/tk8.4/include/tkDecls.h:973: syntax error before "_ANSI_ARGS_"/local/sdm/sw/tk8.4/include/tkDecls.h:974: syntax error before "_ANSI_ARGS_"/local/sdm/sw/tk8.4/include/tkDecls.h:975: syntax error before "_ANSI_ARGS_"/local/sdm/sw/tk8.4/include/tkDecls.h:976: syntax error before "_ANSI_ARGS_"/local/sdm/sw/tk8.4/include/tkDecls.h:977: syntax error before "_ANSI_ARGS_"/local/sdm/sw/tk8.4/include/tkDecls.h:978: syntax error before "_ANSI_ARGS_"/local/sdm/sw/tk8.4/include/tkDecls.h:979: syntax error before "_ANSI_ARGS_"/local/sdm/sw/tk8.4/include/tkDecls.h:980: syntax error before "_ANSI_ARGS_"/local/sdm/sw/tk8.4/include/tkDecls.h:981: syntax error before "_ANSI_ARGS_"/local/sdm/sw/tk8.4/include/tkDecls.h:982: syntax error before "_ANSI_ARGS_"/local/sdm/sw/tk8.4/include/tkDecls.h:983: syntax error before "_ANSI_ARGS_"/local/sdm/sw/tk8.4/include/tkDecls.h:984: syntax error before "_ANSI_ARGS_"/local/sdm/sw/tk8.4/include/tkDecls.h:985: syntax error before "_ANSI_ARGS_"/local/sdm/sw/tk8.4/include/tkDecls.h:986: syntax error before "char"/local/sdm/sw/tk8.4/include/tkDecls.h:986: syntax error before "_ANSI_ARGS_"/local/sdm/sw/tk8.4/include/tkDecls.h:987: syntax error before "_ANSI_ARGS_"/local/sdm/sw/tk8.4/include/tkDecls.h:988: syntax error before "_ANSI_ARGS_"/local/sdm/sw/tk8.4/include/tkDecls.h:989: syntax error before "_ANSI_ARGS_"/local/sdm/sw/tk8.4/include/tkDecls.h:990: syntax error before "_ANSI_ARGS_"/local/sdm/sw/tk8.4/include/tkDecls.h:991: syntax error before "_ANSI_ARGS_"/local/sdm/sw/tk8.4/include/tkDecls.h:992: syntax error before "_ANSI_ARGS_"/local/sdm/sw/tk8.4/include/tkDecls.h:993: syntax error before "_ANSI_ARGS_"/local/sdm/sw/tk8.4/include/tkDecls.h:994: syntax error before "_ANSI_ARGS_"/local/sdm/sw/tk8.4/include/tkDecls.h:995: syntax error before "_ANSI_ARGS_"/local/sdm/sw/tk8.4/include/tkDecls.h:996: syntax error before "_ANSI_ARGS_"/local/sdm/sw/tk8.4/include/tkDecls.h:997: syntax error before "_ANSI_ARGS_"/local/sdm/sw/tk8.4/include/tkDecls.h:998: syntax error before "_ANSI_ARGS_"/local/sdm/sw/tk8.4/include/tkDecls.h:999: syntax error before "_ANSI_ARGS_"/local/sdm/sw/tk8.4/include/tkDecls.h:1000: syntax error before "_ANSI_ARGS_"/local/sdm/sw/tk8.4/include/tkDecls.h:1001: syntax error before "_ANSI_ARGS_"/local/sdm/sw/tk8.4/include/tkDecls.h:1002: syntax error before "_ANSI_ARGS_"/local/sdm/sw/tk8.4/include/tkDecls.h:1003: syntax error before "_ANSI_ARGS_"/local/sdm/sw/tk8.4/include/tkDecls.h:1004: syntax error before "_ANSI_ARGS_"/local/sdm/sw/tk8.4/include/tkDecls.h:1005: syntax error before "_ANSI_ARGS_"/local/sdm/sw/tk8.4/include/tkDecls.h:1006: syntax error before "_ANSI_ARGS_"/local/sdm/sw/tk8.4/include/tkDecls.h:1007: syntax error before "_ANSI_ARGS_"/local/sdm/sw/tk8.4/include/tkDecls.h:1008: syntax error before "_ANSI_ARGS_"/local/sdm/sw/tk8.4/include/tkDecls.h:1009: syntax error before "_ANSI_ARGS_"/local/sdm/sw/tk8.4/include/tkDecls.h:1010: syntax error before "_ANSI_ARGS_"/local/sdm/sw/tk8.4/include/tkDecls.h:1011: syntax error before "_ANSI_ARGS_"/local/sdm/sw/tk8.4/include/tkDecls.h:1012: syntax error before "_ANSI_ARGS_"/local/sdm/sw/tk8.4/include/tkDecls.h:1013: syntax error before "_ANSI_ARGS_"/local/sdm/sw/tk8.4/include/tkDecls.h:1014: syntax error before "char"/local/sdm/sw/tk8.4/include/tkDecls.h:1014: syntax error before "_ANSI_ARGS_"/local/sdm/sw/tk8.4/include/tkDecls.h:1015: syntax error before "char"/local/sdm/sw/tk8.4/include/tkDecls.h:1015: syntax error before "_ANSI_ARGS_"/local/sdm/sw/tk8.4/include/tkDecls.h:1016: syntax error before "_ANSI_ARGS_"/local/sdm/sw/tk8.4/include/tkDecls.h:1017: syntax error before "_ANSI_ARGS_"/local/sdm/sw/tk8.4/include/tkDecls.h:1018: syntax error before "_ANSI_ARGS_"/local/sdm/sw/tk8.4/include/tkDecls.h:1019: syntax error before "_ANSI_ARGS_"/local/sdm/sw/tk8.4/include/tkDecls.h:1020: syntax error before "_ANSI_ARGS_"/local/sdm/sw/tk8.4/include/tkDecls.h:1021: syntax error before "_ANSI_ARGS_"/local/sdm/sw/tk8.4/include/tkDecls.h:1022: syntax error before "_ANSI_ARGS_"/local/sdm/sw/tk8.4/include/tkDecls.h:1023: syntax error before "_ANSI_ARGS_"/local/sdm/sw/tk8.4/include/tkDecls.h:1024: syntax error before "_ANSI_ARGS_"/local/sdm/sw/tk8.4/include/tkDecls.h:1025: syntax error before "_ANSI_ARGS_"/local/sdm/sw/tk8.4/include/tkDecls.h:1026: syntax error before "_ANSI_ARGS_"/local/sdm/sw/tk8.4/include/tkDecls.h:1027: syntax error before "_ANSI_ARGS_"/local/sdm/sw/tk8.4/include/tkDecls.h:1028: syntax error before "_ANSI_ARGS_"/local/sdm/sw/tk8.4/include/tkDecls.h:1029: syntax error before '*' token/local/sdm/sw/tk8.4/include/tkDecls.h:1030: syntax error before "_ANSI_ARGS_"/local/sdm/sw/tk8.4/include/tkDecls.h:1031: syntax error before "_ANSI_ARGS_"/local/sdm/sw/tk8.4/include/tkDecls.h:1032: syntax error before "_ANSI_ARGS_"/local/sdm/sw/tk8.4/include/tkDecls.h:1033: syntax error before "_ANSI_ARGS_"/local/sdm/sw/tk8.4/include/tkDecls.h:1034: syntax error before '*' token/local/sdm/sw/tk8.4/include/tkDecls.h:1035: syntax error before "_ANSI_ARGS_"/local/sdm/sw/tk8.4/include/tkDecls.h:1036: syntax error before "_ANSI_ARGS_"/local/sdm/sw/tk8.4/include/tkDecls.h:1037: syntax error before "_ANSI_ARGS_"/local/sdm/sw/tk8.4/include/tkDecls.h:1038: syntax error before "_ANSI_ARGS_"/local/sdm/sw/tk8.4/include/tkDecls.h:1039: syntax error before "_ANSI_ARGS_"/local/sdm/sw/tk8.4/include/tkDecls.h:1040: syntax error before "_ANSI_ARGS_"/local/sdm/sw/tk8.4/include/tkDecls.h:1041: syntax error before "_ANSI_ARGS_"/local/sdm/sw/tk8.4/include/tkDecls.h:1042: syntax error before '*' token/local/sdm/sw/tk8.4/include/tkDecls.h:1043: syntax error before "_ANSI_ARGS_"/local/sdm/sw/tk8.4/include/tkDecls.h:1044: syntax error before "_ANSI_ARGS_"/local/sdm/sw/tk8.4/include/tkDecls.h:1045: syntax error before "_ANSI_ARGS_"/local/sdm/sw/tk8.4/include/tkDecls.h:1046: syntax error before "_ANSI_ARGS_"/local/sdm/sw/tk8.4/include/tkDecls.h:1047: syntax error before "_ANSI_ARGS_"/local/sdm/sw/tk8.4/include/tkDecls.h:1048: syntax error before "_ANSI_ARGS_"/local/sdm/sw/tk8.4/include/tkDecls.h:1049: syntax error before "_ANSI_ARGS_"/local/sdm/sw/tk8.4/include/tkDecls.h:1050: syntax error before "_ANSI_ARGS_"/local/sdm/sw/tk8.4/include/tkDecls.h:1051: syntax error before "_ANSI_ARGS_"/local/sdm/sw/tk8.4/include/tkDecls.h:1052: syntax error before "_ANSI_ARGS_"/local/sdm/sw/tk8.4/include/tkDecls.h:1053: syntax error before "_ANSI_ARGS_"/local/sdm/sw/tk8.4/include/tkDecls.h:1054: syntax error before "_ANSI_ARGS_"/local/sdm/sw/tk8.4/include/tkDecls.h:1055: syntax error before "_ANSI_ARGS_"/local/sdm/sw/tk8.4/include/tkDecls.h:1056: syntax error before "_ANSI_ARGS_"/local/sdm/sw/tk8.4/include/tkDecls.h:1057: syntax error before "_ANSI_ARGS_"/local/sdm/sw/tk8.4/include/tkDecls.h:1058: syntax error before "_ANSI_ARGS_"/local/sdm/sw/tk8.4/include/tkDecls.h:1059: syntax error before "_ANSI_ARGS_"/local/sdm/sw/tk8.4/include/tkDecls.h:1060: syntax error before "_ANSI_ARGS_"/local/sdm/sw/tk8.4/include/tkDecls.h:1061: syntax error before "char"/local/sdm/sw/tk8.4/include/tkDecls.h:1061: syntax error before "_ANSI_ARGS_"/local/sdm/sw/tk8.4/include/tkDecls.h:1062: syntax error before "char"/local/sdm/sw/tk8.4/include/tkDecls.h:1062: syntax error before "_ANSI_ARGS_"/local/sdm/sw/tk8.4/include/tkDecls.h:1063: syntax error before "char"/local/sdm/sw/tk8.4/include/tkDecls.h:1063: syntax error before "_ANSI_ARGS_"/local/sdm/sw/tk8.4/include/tkDecls.h:1064: syntax error before "char"/local/sdm/sw/tk8.4/include/tkDecls.h:1064: syntax error before "_ANSI_ARGS_"/local/sdm/sw/tk8.4/include/tkDecls.h:1065: syntax error before "char"/local/sdm/sw/tk8.4/include/tkDecls.h:1065: syntax error before "_ANSI_ARGS_"/local/sdm/sw/tk8.4/include/tkDecls.h:1066: syntax error before "char"/local/sdm/sw/tk8.4/include/tkDecls.h:1066: syntax error before "_ANSI_ARGS_"/local/sdm/sw/tk8.4/include/tkDecls.h:1067: syntax error before "char"/local/sdm/sw/tk8.4/include/tkDecls.h:1067: syntax error before "_ANSI_ARGS_"/local/sdm/sw/tk8.4/include/tkDecls.h:1068: syntax error before "char"/local/sdm/sw/tk8.4/include/tkDecls.h:1068: syntax error before "_ANSI_ARGS_"/local/sdm/sw/tk8.4/include/tkDecls.h:1069: syntax error before "char"/local/sdm/sw/tk8.4/include/tkDecls.h:1069: syntax error before "_ANSI_ARGS_"/local/sdm/sw/tk8.4/include/tkDecls.h:1070: syntax error before "char"/local/sdm/sw/tk8.4/include/tkDecls.h:1070: syntax error before "_ANSI_ARGS_"/local/sdm/sw/tk8.4/include/tkDecls.h:1071: syntax error before "char"/local/sdm/sw/tk8.4/include/tkDecls.h:1071: syntax error before "_ANSI_ARGS_"/local/sdm/sw/tk8.4/include/tkDecls.h:1072: syntax error before "_ANSI_ARGS_"/local/sdm/sw/tk8.4/include/tkDecls.h:1073: syntax error before "_ANSI_ARGS_"/local/sdm/sw/tk8.4/include/tkDecls.h:1074: syntax error before "_ANSI_ARGS_"/local/sdm/sw/tk8.4/include/tkDecls.h:1075: syntax error before "_ANSI_ARGS_"/local/sdm/sw/tk8.4/include/tkDecls.h:1076: syntax error before "_ANSI_ARGS_"/local/sdm/sw/tk8.4/include/tkDecls.h:1077: syntax error before "_ANSI_ARGS_"/local/sdm/sw/tk8.4/include/tkDecls.h:1078: syntax error before "_ANSI_ARGS_"/local/sdm/sw/tk8.4/include/tkDecls.h:1079: syntax error before "_ANSI_ARGS_"/local/sdm/sw/tk8.4/include/tkDecls.h:1080: syntax error before "_ANSI_ARGS_"/local/sdm/sw/tk8.4/include/tkDecls.h:1081: syntax error before "_ANSI_ARGS_"/local/sdm/sw/tk8.4/include/tkDecls.h:1082: syntax error before "_ANSI_ARGS_"/local/sdm/sw/tk8.4/include/tkDecls.h:1083: syntax error before "_ANSI_ARGS_"/local/sdm/sw/tk8.4/include/tkDecls.h:1084: syntax error before "_ANSI_ARGS_"/local/sdm/sw/tk8.4/include/tkDecls.h:1085: syntax error before "_ANSI_ARGS_"/local/sdm/sw/tk8.4/include/tkDecls.h:1086: syntax error before "_ANSI_ARGS_"/local/sdm/sw/tk8.4/include/tkDecls.h:1087: syntax error before "_ANSI_ARGS_"/local/sdm/sw/tk8.4/include/tkDecls.h:1088: syntax error before "_ANSI_ARGS_"/local/sdm/sw/tk8.4/include/tkDecls.h:1089: syntax error before "_ANSI_ARGS_"/local/sdm/sw/tk8.4/include/tkDecls.h:1090: syntax error before "_ANSI_ARGS_"/local/sdm/sw/tk8.4/include/tkDecls.h:1091: syntax error before "char"/local/sdm/sw/tk8.4/include/tkDecls.h:1091: syntax error before "_ANSI_ARGS_"/local/sdm/sw/tk8.4/include/tkDecls.h:1092: syntax error before "_ANSI_ARGS_"/local/sdm/sw/tk8.4/include/tkDecls.h:1093: syntax error before "_ANSI_ARGS_"/local/sdm/sw/tk8.4/include/tkDecls.h:1094: syntax error before "_ANSI_ARGS_"/local/sdm/sw/tk8.4/include/tkDecls.h:1095: syntax error before "_ANSI_ARGS_"/local/sdm/sw/tk8.4/include/tkDecls.h:1096: syntax error before "_ANSI_ARGS_"/local/sdm/sw/tk8.4/include/tkDecls.h:1097: syntax error before "_ANSI_ARGS_"/local/sdm/sw/tk8.4/include/tkDecls.h:1098: syntax error before "_ANSI_ARGS_"/local/sdm/sw/tk8.4/include/tkDecls.h:1099: syntax error before "_ANSI_ARGS_"/local/sdm/sw/tk8.4/include/tkDecls.h:1100: syntax error before "_ANSI_ARGS_"/local/sdm/sw/tk8.4/include/tkDecls.h:1101: syntax error before "_ANSI_ARGS_"/local/sdm/sw/tk8.4/include/tkDecls.h:1102: syntax error before "_ANSI_ARGS_"/local/sdm/sw/tk8.4/include/tkDecls.h:1103: syntax error before "_ANSI_ARGS_"/local/sdm/sw/tk8.4/include/tkDecls.h:1104: syntax error before "_ANSI_ARGS_"/local/sdm/sw/tk8.4/include/tkDecls.h:1105: syntax error before "_ANSI_ARGS_"/local/sdm/sw/tk8.4/include/tkDecls.h:1106: syntax error before "_ANSI_ARGS_"/local/sdm/sw/tk8.4/include/tkDecls.h:1107: syntax error before "_ANSI_ARGS_"/local/sdm/sw/tk8.4/include/tkDecls.h:1108: syntax error before "_ANSI_ARGS_"/local/sdm/sw/tk8.4/include/tkDecls.h:1109: syntax error before "_ANSI_ARGS_"/local/sdm/sw/tk8.4/include/tkDecls.h:1110: syntax error before "_ANSI_ARGS_"/local/sdm/sw/tk8.4/include/tkDecls.h:1111: syntax error before "_ANSI_ARGS_"/local/sdm/sw/tk8.4/include/tkDecls.h:1112: syntax error before "_ANSI_ARGS_"/local/sdm/sw/tk8.4/include/tkDecls.h:1113: syntax error before "_ANSI_ARGS_"/local/sdm/sw/tk8.4/include/tkDecls.h:1114: syntax error before "_ANSI_ARGS_"/local/sdm/sw/tk8.4/include/tkDecls.h:1115: syntax error before "_ANSI_ARGS_"/local/sdm/sw/tk8.4/include/tkDecls.h:1116: syntax error before "_ANSI_ARGS_"/local/sdm/sw/tk8.4/include/tkDecls.h:1117: syntax error before "_ANSI_ARGS_"/local/sdm/sw/tk8.4/include/tkDecls.h:1118: syntax error before "_ANSI_ARGS_"/local/sdm/sw/tk8.4/include/tkDecls.h:1119: syntax error before "_ANSI_ARGS_"/local/sdm/sw/tk8.4/include/tkDecls.h:1120: syntax error before "_ANSI_ARGS_"/local/sdm/sw/tk8.4/include/tkDecls.h:1121: syntax error before "_ANSI_ARGS_"/local/sdm/sw/tk8.4/include/tkDecls.h:1122: syntax error before "_ANSI_ARGS_"/local/sdm/sw/tk8.4/include/tkDecls.h:1123: syntax error before "_ANSI_ARGS_"/local/sdm/sw/tk8.4/include/tkDecls.h:1124: syntax error before "_ANSI_ARGS_"/local/sdm/sw/tk8.4/include/tkDecls.h:1125: syntax error before "_ANSI_ARGS_"/local/sdm/sw/tk8.4/include/tkDecls.h:1126: syntax error before "_ANSI_ARGS_"/local/sdm/sw/tk8.4/include/tkDecls.h:1127: syntax error before "_ANSI_ARGS_"/local/sdm/sw/tk8.4/include/tkDecls.h:1128: syntax error before "_ANSI_ARGS_"/local/sdm/sw/tk8.4/include/tkDecls.h:1129: syntax error before "_ANSI_ARGS_"/local/sdm/sw/tk8.4/include/tkDecls.h:1130: syntax error before "_ANSI_ARGS_"/local/sdm/sw/tk8.4/include/tkDecls.h:1131: syntax error before "_ANSI_ARGS_"/local/sdm/sw/tk8.4/include/tkDecls.h:1132: syntax error before "_ANSI_ARGS_"/local/sdm/sw/tk8.4/include/tkDecls.h:1133: syntax error before "_ANSI_ARGS_"/local/sdm/sw/tk8.4/include/tkDecls.h:1134: syntax error before "_ANSI_ARGS_"/local/sdm/sw/tk8.4/include/tkDecls.h:1135: syntax error before "_ANSI_ARGS_"/local/sdm/sw/tk8.4/include/tkDecls.h:1136: syntax error before "_ANSI_ARGS_"/local/sdm/sw/tk8.4/include/tkDecls.h:1137: syntax error before "_ANSI_ARGS_"/local/sdm/sw/tk8.4/include/tkDecls.h:1138: syntax error before "_ANSI_ARGS_"/local/sdm/sw/tk8.4/include/tkDecls.h:1139: syntax error before "_ANSI_ARGS_"/local/sdm/sw/tk8.4/include/tkDecls.h:1140: syntax error before "_ANSI_ARGS_"/local/sdm/sw/tk8.4/include/tkDecls.h:1141: syntax error before "_ANSI_ARGS_"/local/sdm/sw/tk8.4/include/tkDecls.h:1142: syntax error before "_ANSI_ARGS_"/local/sdm/sw/tk8.4/include/tkDecls.h:1143: syntax error before "_ANSI_ARGS_"/local/sdm/sw/tk8.4/include/tkDecls.h:1144: syntax error before "_ANSI_ARGS_"/local/sdm/sw/tk8.4/include/tkDecls.h:1145: syntax error before "_ANSI_ARGS_"/local/sdm/sw/tk8.4/include/tkDecls.h:1146: syntax error before "_ANSI_ARGS_"/local/sdm/sw/tk8.4/include/tkDecls.h:1147: syntax error before "_ANSI_ARGS_"/local/sdm/sw/tk8.4/include/tkDecls.h:1148: syntax error before "_ANSI_ARGS_"/local/sdm/sw/tk8.4/include/tkDecls.h:1151: syntax error before "_ANSI_ARGS_"/local/sdm/sw/tk8.4/include/tkDecls.h:1152: syntax error before "_ANSI_ARGS_"/local/sdm/sw/tk8.4/include/tkDecls.h:1153: syntax error before "_ANSI_ARGS_"/local/sdm/sw/tk8.4/include/tkDecls.h:1154: syntax error before "_ANSI_ARGS_"/local/sdm/sw/tk8.4/include/tkDecls.h:1155: syntax error before "_ANSI_ARGS_"/local/sdm/sw/tk8.4/include/tkDecls.h:1156: syntax error before "_ANSI_ARGS_"/local/sdm/sw/tk8.4/include/tkDecls.h:1157: syntax error before "_ANSI_ARGS_"/local/sdm/sw/tk8.4/include/tkDecls.h:1158: syntax error before "_ANSI_ARGS_"/local/sdm/sw/tk8.4/include/tkDecls.h:1159: syntax error before "_ANSI_ARGS_"/local/sdm/sw/tk8.4/include/tkDecls.h:1160: syntax error before "_ANSI_ARGS_"/local/sdm/sw/tk8.4/include/tkDecls.h:1161: syntax error before "_ANSI_ARGS_"/local/sdm/sw/tk8.4/include/tkDecls.h:1162: syntax error before "_ANSI_ARGS_"/local/sdm/sw/tk8.4/include/tkDecls.h:1163: syntax error before "_ANSI_ARGS_"/local/sdm/sw/tk8.4/include/tkDecls.h:1164: syntax error before "_ANSI_ARGS_"/local/sdm/sw/tk8.4/include/tkDecls.h:1165: syntax error before "_ANSI_ARGS_"/local/sdm/sw/tk8.4/include/tkDecls.h:1166: syntax error before "_ANSI_ARGS_"/local/sdm/sw/tk8.4/include/tkDecls.h:1167: syntax error before "_ANSI_ARGS_"/local/sdm/sw/tk8.4/include/tkDecls.h:1168: syntax error before "_ANSI_ARGS_"/local/sdm/sw/tk8.4/include/tkDecls.h:1169: syntax error before "_ANSI_ARGS_"/local/sdm/sw/tk8.4/include/tkDecls.h:1170: syntax error before "_ANSI_ARGS_"/local/sdm/sw/tk8.4/include/tkDecls.h:1171: syntax error before "_ANSI_ARGS_"/local/sdm/sw/tk8.4/include/tkDecls.h:1172: syntax error before "_ANSI_ARGS_"/local/sdm/sw/tk8.4/include/tkDecls.h:1173: syntax error before "_ANSI_ARGS_"/local/sdm/sw/tk8.4/include/tkDecls.h:1174: syntax error before "_ANSI_ARGS_"/local/sdm/sw/tk8.4/include/tkDecls.h:1175: syntax error before "_ANSI_ARGS_"/local/sdm/sw/tk8.4/include/tkDecls.h:1176: syntax error before "_ANSI_ARGS_"/local/sdm/sw/tk8.4/include/tkDecls.h:1177: syntax error before "_ANSI_ARGS_"/local/sdm/sw/tk8.4/include/tkDecls.h:1178: syntax error before "_ANSI_ARGS_"/local/sdm/sw/tk8.4/include/tkDecls.h:1179: syntax error before "_ANSI_ARGS_"/local/sdm/sw/tk8.4/include/tkDecls.h:1180: syntax error before "_ANSI_ARGS_"/local/sdm/sw/tk8.4/include/tkDecls.h:1181: syntax error before "_ANSI_ARGS_"/local/sdm/sw/tk8.4/include/tkDecls.h:1182: syntax error before "_ANSI_ARGS_"/local/sdm/sw/tk8.4/include/tkDecls.h:1183: syntax error before "_ANSI_ARGS_"/local/sdm/sw/tk8.4/include/tkDecls.h:1184: syntax error before "_ANSI_ARGS_"/local/sdm/sw/tk8.4/include/tkDecls.h:1185: syntax error before "_ANSI_ARGS_"/local/sdm/sw/tk8.4/include/tkDecls.h:1186: syntax error before "_ANSI_ARGS_"/local/sdm/sw/tk8.4/include/tkDecls.h:1187: syntax error before "char"/local/sdm/sw/tk8.4/include/tkDecls.h:1187: syntax error before "_ANSI_ARGS_"/local/sdm/sw/tk8.4/include/tkDecls.h:1188: syntax error before "_ANSI_ARGS_"/local/sdm/sw/tk8.4/include/tkDecls.h:1189: syntax error before "_ANSI_ARGS_"/local/sdm/sw/tk8.4/include/tkDecls.h:1190: syntax error before "_ANSI_ARGS_"/local/sdm/sw/tk8.4/include/tkDecls.h:1191: syntax error before "_ANSI_ARGS_"/local/sdm/sw/tk8.4/include/tkDecls.h:1192: syntax error before "_ANSI_ARGS_"/local/sdm/sw/tk8.4/include/tkDecls.h:1193: syntax error before "_ANSI_ARGS_"/local/sdm/sw/tk8.4/include/tkDecls.h:1194: syntax error before "_ANSI_ARGS_"/local/sdm/sw/tk8.4/include/tkDecls.h:1195: syntax error before "_ANSI_ARGS_"/local/sdm/sw/tk8.4/include/tkDecls.h:1196: warning: data definition has no type or storage class/local/sdm/sw/tk8.4/include/tkDecls.h:1201: syntax error before '*' token/local/sdm/sw/tk8.4/include/tkDecls.h:1201: warning: data definition has no type or storage classxcwrap.c:14: syntax error before '*' tokenxcwrap.c:14: warning: data definition has no type or storage classxcwrap.c:15: syntax error before '*' tokenxcwrap.c:15: warning: data definition has no type or storage classxcwrap.c:132: syntax error before "XcTagTable"xcwrap.c:132: warning: data definition has no type or storage classxcwrap.c:139: syntax error before '*' tokenxcwrap.c: In function `Xcircuit_Init':xcwrap.c:149: `interp' undeclared (first use in this function)xcwrap.c:149: (Each undeclared identifier is reported only oncexcwrap.c:149: for each function it appears in.)xcwrap.c:149: `TCL_ERROR' undeclared (first use in this function)xcwrap.c:154: warning: comparison between pointer and integerxcwrap.c:163: warning: assignment makes pointer from integer without a castxcwrap.c:170: `Tcl_ObjCmdProc' undeclared (first use in this function)xcwrap.c:170: syntax error before ')' tokenxcwrap.c:179: syntax error before ')' tokenxcwrap.c:198: `TCL_GLOBAL_ONLY' undeclared (first use in this function)xcwrap.c:226: warning: assignment makes pointer from integer without a castxcwrap.c:231: `TCL_STRING_KEYS' undeclared (first use in this function)xcwrap.c:233: `TCL_OK' undeclared (first use in this function)make[2]: *** [xcwrap.o] Error 1make[1]: *** [tcl] Error 2make: *** [all-recursive] Error 2


  • Login